{"text_format":"1","workbook":"xlsx","n_sheets":5,"sheets":["Guidance","Questionnaire","Scoresheet ","Action Plan","Data sheet"],"not_rendered":{"charts":0,"images":0,"macros":1,"external_links":0,"defined_names":31,"comments":0,"pivot_tables":0},"unopened":[],"bounds":{"document_bytes":16777216,"sheet_cells":100000,"rows_first":2000,"rows_last":500,"rows_between":2000,"halvings":0,"cell_chars":16384,"cell_head_chars":4096},"cells_cut":0,"cells_raw":0,"read":"whole","date_system":"1900"}

{"sheet":"Guidance","index":0,"n_rows":27,"n_cols":2,"rows_kept":27,"cut":false,"hidden":false,"merged":[]}
[null,"UN Women WEPs COVID-19 Response Guidance "]
[]
[]
[]
[null,"Introduction"]
[]
[null,"Why focus on women's empowerment and gender equality during COVID-19?"]
[null,"Women’s economic empowerment will be essential if we are to ensure that the economic recovery from COVID-19 in Asia and the Pacific is as rapid as possible and includes all members of society. Emerging numbers indicate that the COVID-19 may be more lethal for men, but women are taking the bigger socio-economic hit from the global pandemic. The societal and economic consequences are not\nimpacting everyone equally but are hitting the most vulnerable the hardest and exacerbating existing social and economic inequalities. Women are disproportionately affected because they are most exposed to risks at both health and economic levels. They make up the majority of front-line workers in care and other professions that are based on personal interaction, exposing them to higher risks of contagion. They are also overrepresented in precarious employment, including in the informal sector, where their benefits and protection are inadequate or lacking. For more information see: https://www2.unwomen.org/-/media/field%20office%20eseasia/docs/publications/2020/04/200409_covid%20action_v11.pdf?la=en&vs=710 "]
[]
[null,"Score Details & Instructions"]
[null,"Under each pillar there are a series of questions. These questions are either beginner or achiever level.  Once the questionnaire is complete, the action plan will be automatically complete based on your answers. For each question, there are associated actions. These actions are divided into priorities: high, medium or low, based on whether the focus area is a beginner or achiever level area and how immediate the action needs to be taken. There will be long-term actions to consider under each question, even if the question was answered 'yes'. Each action has a color assigned based on its priority:  "]
[null,"HIGH PRIORITY ACTION "]
[null,"MEDIUM PRIORITY ACTION "]
[null,"LOW PRIORITY ACTION "]
[null,"LONG-TERM ACTION"]
{"$rows_left_out":13}
{"sheet":"Questionnaire","index":1,"n_rows":31,"n_cols":7,"rows_kept":31,"cut":false,"hidden":false,"merged":[[29,5,30,5],[12,5,13,5],[0,0,0,6],[24,5,25,5],[18,5,20,5]]}
["UN Women WEPs COVID-19 Response Guidance "]
["                   DIMENSION  1: COMMITMENT "]
[null,"1. LEADERSHIP ","Level ","Yes/No","Corresponding WEP","Why does it matter?","Recommended approaches"]
["1.1. ","Has your company integrated gender concerns into its leadership commitments, strategy, and support for COVID-19? ","Beginner ","No",1,"Corporate leadership is a key and integral part of ensuring a company's COVID-19 response is gender sensitive and ensuring previous efforts towards gender equality and women’s empowerment are not lost during this time. Including a gender lens in a company's leadership response to COVID-19 further demonstrates commitment to gender equality and women’s empowerment and an understanding of the unique positions women face in times of crisis. ","Integrate gender concerns into your company's COVID-19 response and internally and/or publicly acknowledge the relevance of gender equality and women's empowerment issues during COVID-19 pandemic response. \r\n"]
["1.2.","Has your company established a COVID-19 task force team with women as part of this group? ","Beginner ","No",1,"Women are often excluded from key-decision making groups resulting in solutions that are not gender-sensitive. Including women as part of your company's COVID-19 task force is the first step to ensure that gender concerns are taken into account in finding new solutions. ","Ensure that women participate in COVID-19 leadership decisions and embed gender concerns and gender expertise within response plans and budget resources to build gender expertise into response teams. Companies should aim for a minimum of 40% representation of women on the task force.  "]
["1.3.","Has your company engaged local or national government to advocate for gender responsive measures to COVID-19 in your community? ","Achiever ","No",1,null,"Join public advocacy campaigns or advocate in public forums for gender considerations to be included in COVID-19 responses including stimulus packages, funding for NGOs and relief funding for the private sector. \n\n"]
[]
["                     2. REPRESENTATION & LEADERSHIP"]
[null,"2. WORKPLACE ","Level ","Yes/No",null,"Why does it matter?","Recommended approaches"]
["2.1.","Does your company have a non-discrimination and equal opportunity policy that can be implemented as part of a gender sensitive approach to the COVID-19 pandemic response as well as in the wake of the pandemic to ensure the continued professional development and promotion of women? ","Beginner ","No","2, 4","The increased responsibility to care for children, the sick and the elderly impacts women at all levels, increasing the likelihood that women on a career path or in leadership positions will be among those giving up their jobs or scaling back their workload. Companies that have made commitments to promote women in leadership roles may find that many promising women candidates are forced or choose to step back from work during this time to care for their family. Those in charge of promotions and retentions may privilege employees who continued working at full capacity during the pandemic. In the long-term, this may widen vertical gender gaps as more women miss out on promotion or are forced out of the workforce. ","Acknowledge the increased care burden on women and encourage male employees to take their share of the care burden during this time and commit to non-discrimination and equal opportunity for women during COVID-19."]
["2.2.","Does your company have policies, approaches to ensure an environment free of violence, harassment, and sexual exploitation and offer adequate support to victims while employees work from home during the COVID-19 pandemic response?  ","Beginner ","No",3,"Women and children in self-isolation or in quarantine are also vulnerable to domestic violence. Not all homes are safe, and enforced periods of isolation in the home may put many women at risk of domestic violence. Instance of violence are likely to increase during crises, due to increase stress, anxiety, substance abuse and the inability to leave. Domestic violence is not only harmful to women, it impedes economic growth and stalls societal development. Violence—both at home and in the workplace—ultimately results in lost productivity, absenteeism, isolation from co-workers, slowed career progression, and increased training and recruitment costs for employers.","Raise awareness on domestic violence as part of the company’s COVID-19 response and review policies to support victims of domestic violence, including by providing information on how to access local and national support services.\n"]
["2.3.","Does your company have an approach to address the specific health, safety, and hygiene needs of women required to come into work and commute to work during the COVID-19 pandemic (such as access to PPE and menstrual hygiene products)?","Beginner ","No",3,"Workplaces are a common location for communicable disease transmission among adults as it hosts people coming from different and densely populated communities into one confined space where workers find themselves in close proximity to each other and handling the same objects. These challenges are heightened for women workers because women are especially vulnerable to a myriad of health issues due to lower health literacy levels, less access to health care, and less decision-making power in health matters. \n\nWomen are more likely than men to rely on public transportation to get to work. During the crisis many public transportation systems have been shut down or decreased. This may limit women's ability to get to work. ","Provide all workers, women and men, with the necessary protective equipment material, in the correct size, and training on how to use it. This material should be adapted to pregnant workers as needed. Provide reliable and safe transportation to all frontline workers as needed, especially when public transportation is not available."]
["2.4.","Does your company have an approach to support women and men as parents and caregivers during the COVID-19 pandemic response such as paid parental leave, access or monetary support for childcare and flexible working arrangements given the increase need for childcare and caregiving?","Beginner ","No",2," Globally, women do three times as much unpaid care work as men. With the closure of schools; overloaded health systems; and an increase in infections in the population, a greater burden is placed on care in the home and the burden of unpaid domestic and care work has increased for women. Women’s ability to work from home effectively or go to work will be impacted by their greater care burden and need to support children’s home education during the pandemic. ","Expand or enhance parental and caregiver benefits and services, and work-life balance policies to all employees during COVID-19."]
["2.5.","Does your company have an approach to encourage shared care work and support all employees, including men, to take on more care work including awareness raising and a paid parental leave policy for men to care for children. ","Achiever ","No",3,null,"Ensure that women and men employees receive equal parental and caregiver benefits during COVID-19 and raise awareness on the role of men in care work."]
[]
{"$rows_left_out":17}
{"sheet":"Scoresheet ","index":2,"n_rows":11,"n_cols":5,"rows_kept":11,"cut":false,"hidden":false,"merged":[[0,0,0,4],[3,1,3,2],[3,3,3,4]]}
["UN Women WEPs COVID-19 Response Scoresheet"]
[]
[]
[null,"Beginner ",null,"Achiever "]
[null,"Actions Taken ","No Actions Taken","Actions taken  ","No Actions Taken"]
["1. LEADERSHIP ",{"$f":"'Data sheet'!D44","v":0},{"$f":"'Data sheet'!B44","v":2},{"$f":"'Data sheet'!E44","v":0},{"$f":"'Data sheet'!C44","v":1}]
["2. WORKPLACE ",{"$f":"'Data sheet'!D50","v":0},{"$f":"'Data sheet'!B50","v":3},{"$f":"'Data sheet'!E50","v":0},{"$f":"'Data sheet'!C50","v":2}]
["3. MARKETPLACE",{"$f":"'Data sheet'!D55","v":0},{"$f":"'Data sheet'!B55","v":2},{"$f":"'Data sheet'!E55","v":0},{"$f":"'Data sheet'!C55","v":2}]
["4. COMMUNITY ",{"$f":"'Data sheet'!D58","v":0},{"$f":"'Data sheet'!B58","v":1},{"$f":"'Data sheet'!E58","v":0},{"$f":"'Data sheet'!C58","v":1}]
["5. SEX-DISAGGREGATED DATA ",{"$f":"'Data sheet'!D61","v":0},{"$f":"'Data sheet'!B61","v":1},{"$f":"'Data sheet'!E61","v":0},{"$f":"'Data sheet'!C61","v":1}]
["TOTAL: ",{"$f":"SUM(B6:B10)","v":0},{"$f":"SUM(C6:C10)","v":9},{"$f":"SUM(D6:D10)","v":0},7]

{"sheet":"Action Plan","index":3,"n_rows":47,"n_cols":7,"rows_kept":47,"cut":false,"hidden":false,"merged":[[39,3,39,4],[44,3,44,4],[23,1,25,1],[13,3,13,4],[14,3,15,3],[23,2,25,2],[30,1,32,1],[30,2,32,2],[33,1,34,1],[33,2,34,2],[0,0,0,5],[30,0,32,0],[30,3,31,3],[33,3,34,3],[4,3,4,4],[17,0,19,0],[20,0,22,0],[23,0,25,0],[33,0,34,0],[29,3,29,4],[14,0,16,0],[17,3,18,3],[20,3,21,3],[23,3,25,3],[5,3,6,3],[5,1,7,1],[5,0,7,0],[8,1,9,1],[8,0,9,0],[20,1,22,1],[20,2,22,2],[5,2,6,2],[14,1,16,1],[14,2,16,2],[17,1,19,1],[17,2,19,2]]}
["UN Women WEPs COVID-19 Action Plan"]
[]
[null,"Immediate next steps are ranked by priority from high to low. "]
[]
[null,"1. LEADERSHIP ","Yes/No","Actions",null,"Priority level "]
["1.1.","Has your company integrated gender into its leadership commitments, strategy, and support for COVID-19? ",{"$f":"Questionnaire!D4","v":"No"},"Immediate next steps",{"$f":"IF(C6=\"Yes\",,'Data sheet'!C3)","v":"Circulate an internal communication(s) and/or informal acknowledgement of the relevance of gender equality and women's empowerment during COVID-19 pandemic response. "},{"$f":"IF(C6=\"Yes\",,\"High\")","v":"High"},{"$f":"IF($C$6=\"Yes\",0,1)","v":1}]
[null,null,null,null,{"$f":"IF(C6=\"Yes\",,'Data sheet'!C4)","v":"Release a public written statement or commitment outlining your company's commitment to gender equality and the WEPs during the COVID-19 pandemic response and beyond. "},{"$f":"IF(C6=\"Yes\",,\"Medium\")","v":"Medium"},{"$f":"IF($C$6=\"Yes\",0,1)","v":1}]
[null,null,null,"Long term considerations",{"$f":"IF(F6=\"Yes\",,'Data sheet'!D3)","v":"If not already, consider becoming a signatory to the Women's Empowerment Principles (WEPs): https://www.weps.org/. "}]
["1.2.","Has your company established a COVID-19 task force team with women as part of this group? ",{"$f":"Questionnaire!D5","v":"No"},"Immediate next steps",{"$f":"IF(C9=\"Yes\",,'Data sheet'!C5)","v":"Establish a COVID-19 task force ensuring women are included as active members with decision-making power. If your company already has a COVID-19 task force without women, ensure to add women members and review existing COVID-19 responses with all new members. Companies should aim for a minimum of 40% representation of women on the task force.  "},{"$f":"IF(C9=\"Yes\",,\"High\")","v":"High"},{"$f":"IF($C$9=\"Yes\",0,1)","v":1}]
[null,null,null,"Long term considerations",{"$f":"IF(F9=\"Yes\",,'Data sheet'!D5)","v":"Ensure that women participate in COVID-19 and other emergency response leadership decisions and embed gender dimensions and gender experts within emergency response plans and budget resources to build gender expertise into response teams. "}]
["1.3.","Has your company engaged local or national government to advocate for gender responsive measures to COVID-19 in your community? ",{"$f":"Questionnaire!D6","v":"No"},"Immediate next steps",{"$f":"IF(C11=\"Yes\",,'Data sheet'!C6)","v":"Review your national and local context for any public advocacy campaigns or private sector consultation processes to join.\n\nIdentify local and national government members or initiatives, including women and gender ministries to engage or lobby for the inclusion of gender considerations in COVID-19 responses. "},{"$f":"IF(C11=\"Yes\",,\"Medium\")","v":"Medium"},{"$f":"IF($C$11=\"Yes\",0,1)","v":1}]
[]
["                     2. REPRESENTATION & LEADERSHIP",null,{"$f":"Questionnaire!D8","v":0},null,{"$f":"IF(C13=\"Yes\",,'Data sheet'!C8)","v":0}]
[null,"2. WORKPLACE ","Yes/No","Actions",null,"Priority level "]
["2.1. ","Does your company have a non-discrimination and equal opportunity policy that can be implemented as part of a gender sensitive approach to the COVID-19 pandemic response as well as in the wake of the pandemic to ensure the continued professional development and promotion of women? ",{"$f":"Questionnaire!D10","v":"No"},"Immediate next steps",{"$f":"IF(C15=\"Yes\",,'Data sheet'!C10)","v":"Release an internal statement that acknowledges the increased care burden on women and men during this time and commits to upholding the principles of non-discrimination and equal opportunity for women during COVID-19. \n\nRaise awareness with managers and senior leaders on the gendered impact of COVID-19 on women's performance and working hours through internal briefings. "},{"$f":"IF(C15=\"Yes\",,\"High\")","v":"High"},{"$f":"IF($C$15=\"Yes\",0,1)","v":1}]
{"$rows_left_out":33}
{"sheet":"Data sheet","index":4,"n_rows":62,"n_cols":5,"rows_kept":62,"cut":false,"hidden":true,"merged":[[2,0,3,0],[9,0,10,0],[11,0,12,0],[8,0,8,3],[1,0,1,3],[35,0,35,3],[13,0,14,0],[15,0,17,0],[22,0,23,0],[24,0,25,0],[21,0,21,3],[30,0,30,3]]}
[null,"Priority level ","Immediate next steps ","Long term considerations "]
["1. LEADERSHIP "]
["1.1. ",1,"Circulate an internal communication(s) and/or informal acknowledgement of the relevance of gender equality and women's empowerment during COVID-19 pandemic response. ","If not already, consider becoming a signatory to the Women's Empowerment Principles (WEPs): https://www.weps.org/. "]
[null,2,"Release a public written statement or commitment outlining your company's commitment to gender equality and the WEPs during the COVID-19 pandemic response and beyond. "]
[1.2,1,"Establish a COVID-19 task force ensuring women are included as active members with decision-making power. If your company already has a COVID-19 task force without women, ensure to add women members and review existing COVID-19 responses with all new members. Companies should aim for a minimum of 40% representation of women on the task force.  ","Ensure that women participate in COVID-19 and other emergency response leadership decisions and embed gender dimensions and gender experts within emergency response plans and budget resources to build gender expertise into response teams. "]
[1.3,1,"Review your national and local context for any public advocacy campaigns or private sector consultation processes to join.\n\nIdentify local and national government members or initiatives, including women and gender ministries to engage or lobby for the inclusion of gender considerations in COVID-19 responses. "]
[]
[]
["2. WORKPLACE "]
[2.1,1,"Release an internal statement that acknowledges the increased care burden on women and men during this time and commits to upholding the principles of non-discrimination and equal opportunity for women during COVID-19. \n\nRaise awareness with managers and senior leaders on the gendered impact of COVID-19 on women's performance and working hours through internal briefings. ","Establish a non-discrimination and equal opportunity policy to ensure the appropriate approach to gender equality in your company beyond COVID-19\n\nReview and compare promotion, wages and bonuses data for women and men for the 24 months following the crisis to ensure it does not have negative impacts on women's outcomes in the workplace. Where negative impacts are found, take proactive measures to redress these outcomes. "]
[null,2,"Make professional development opportunities available for women during and after COVID-19 such as training, mentoring and coaching.  \n\nAdjust your annual review processes and employee KPIs to consider the gendered impact of COVID-19 so that women and men are not penalized for taking time off during the crisis. "]
[2.2000000000000002,1,"Become familiar with the issue: domestic violence impacts employees and workforces under “normal” circumstances, and in the COVID-19 context, reports have risen dramatically. Messages from employers that support staff safety on this issue are extremely valuable, and guidance is available with sample steps to take. https://asiapacific.unwomen.org/en/digital-library/publications/2019/10/workplace-responses-to-intimate-partner-violence\n\nRelease information for all employees about domestic violence during COVID-19, recognizing that this can happen to anyone and that domestic violence reports have increased dramatically at this time. Information should include information on local helplines, support centers, emergency services, legal support, accommodation/shelters, and counselling.  \n\nAdapt existing policies to support victims in remote working situations.\n\n","Create a long-term policy to support victims of domestic violence beyond COVID-19 through enhanced flexible work arrangements for both schedule and location, temporary protection against dismissal as appropriate, and access to counselling services.\n\nGain support of senior leaders to show support for anyone experiencing domestic violence, which the company asserts through practical actions.  \n\nPartner with and support local gender-based violence and domestic violence organizations to raise awareness among employees and provides access to support services. \n"]
[null,2,"Create an emergency policy to support victims of domestic violence through enhanced flexible work arrangements for both schedule and location, temporary protection against dismissal as appropriate, and access to counselling services. "]
[2.2999999999999998,null,"Ensure a safe transportation system for essential frontline workers including where necessary providing temporary private transportation or additional funding for private transportation. \n\nProvide accessible and safe accommodation, with separate facilities for women and men, if essential frontline workers cannot go back home because of lockdowns.\n\nProvide wellness and well-being sessions during the pandemic.\n\nProvide emergency childcare for essential frontline workers. \n\nProvide personal protective equipment and hand hygiene facilities for frontline workers, especially taking into consideration the needs of pregnant and nursing women. \n\nProvide sick leave and ensure no wage penalties for women workers who contract COVID-19 or are required to self-quarantine, particularly for women at the base of supply chains who are unlikely to have social protection and insurance  ","Implement a gender-responsive employee health and safety program based on employee needs e.g. WASH, or mental health care."]
[null,2,"Provide access to mental health support and expanded health insurance and sick leave arrangements to account for both the mental and physical impact of COVID-19."]
{"$rows_left_out":47}